{"text_format":"1","workbook":"xlsx","n_sheets":5,"sheets":["Gesamtspielplan","Makros","Hallenliste","Einstellungen","HVW-Staffelinfo Termine"],"not_rendered":{"charts":0,"images":0,"macros":1,"external_links":2,"defined_names":5,"comments":2,"pivot_tables":0},"unopened":[],"bounds":{"document_bytes":16777216,"sheet_cells":100000,"rows_first":2000,"rows_last":500,"rows_between":2000,"halvings":0,"cell_chars":16384,"cell_head_chars":4096},"cells_cut":0,"cells_raw":0,"read":"whole","date_system":"1900"}

{"sheet":"Gesamtspielplan","index":0,"n_rows":51,"n_cols":14,"rows_kept":51,"cut":false,"hidden":false,"merged":[]}
["Woche","M","Tag","Datum","Zeit","Spiel","von","bis","Heimmannschaft HPlö","Auswärtsmannschaft","Liga","H-Nr","Halleninformation","Ergebnis"]
[{"$f":"IF(D2=\"\",\"\",YEAR(D2+IF(WEEKDAY(DATE(YEAR(D2),1,1),2)<4,0,-1)) & \" / \" & REPT(\"0\", 2-LEN(WEEKNUM(D2,21))) & WEEKNUM(D2,21))","v":""},null,null,null,null,null,null,null,"Letzte Änderung:","06.09.2023",null,null,null,"HPlö"]
["2023 / 41","mU10",{"$f":"TEXT(D3,\"TTT\")","v":"So"},"2023-10-15",null,null,null,null,"Alpla HC Hard","1. Spieltag","mU10",8109,null,"HPlö"]
["2023 / 41","wu10",{"$f":"TEXT(D4,\"TTT\")","v":"So"},"2023-10-15",null,null,{"$f":"IF(#REF!=\"J\",IF(#REF!=\"\",\"\",IF(#REF!=0,\"\",IF(#REF!=\"\",\"\",#REF!+(#REF!/60/24)))),\"\")","v":{"$error":"#REF!"}},null,"Alpla HC Hard","1. Spieltag","wu10",8109,{"$f":"IF(#REF!=\"J\",\"\",IF($L4=\"\",\"\",IF(ISNA(VLOOKUP($L4,Hallenliste!$A$2:$B$1003,1,FALSE)),\"????\",VLOOKUP($L4,Hallenliste!$A$2:$B$1003,2,FALSE))))","v":{"$error":"#REF!"}},"HPlö"]
["2023 / 41","U08",{"$f":"TEXT(D5,\"TTT\")","v":"So"},"2023-10-15",null,null,{"$f":"IF(#REF!=\"J\",IF($E5=\"\",\"\",IF(#REF!=0,\"\",IF(#REF!=\"\",\"\",$E5+(#REF!/60/24)))),\"\")","v":{"$error":"#REF!"}},null,"Bregenz Handball","1. Spieltag","U08",8107,{"$f":"IF(#REF!=\"J\",\"\",IF($L5=\"\",\"\",IF(ISNA(VLOOKUP($L5,[1]Hallenliste!$A$2:$B$1002,1,FALSE)),\"????\",VLOOKUP($L5,[1]Hallenliste!$A$2:$B$1002,2,FALSE))))","v":{"$error":"#REF!"}},"HPlö"]
["",null,null,null,null,null,null,null,null,null,null,null,{"$f":"IF(#REF!=\"J\",\"\",IF($L6=\"\",\"\",IF(ISNA(VLOOKUP($L6,Hallenliste!$A$2:$B$1003,1,FALSE)),\"????\",VLOOKUP($L6,Hallenliste!$A$2:$B$1003,2,FALSE))))","v":{"$error":"#REF!"}},"HPlö"]
[{"$f":"IF(D7=\"\",\"\",YEAR(D7+IF(WEEKDAY(DATE(YEAR(D7),1,1),2)<4,0,-1)) & \" / \" & REPT(\"0\", 2-LEN(WEEKNUM(D7,21))) & WEEKNUM(D7,21))","v":"2023 / 43"},null,{"$f":"TEXT(D7,\"TTT\")","v":"Do"},"2023-10-26",null,{"$f":"IF(#REF!=\"J\",IF($E7=\"\",\"\",IF(#REF!=0,\"\",IF(#REF!=\"\",\"\",$E7-(#REF!/60/24)))),\"\")","v":{"$error":"#REF!"}},{"$f":"IF(#REF!=\"J\",IF($E7=\"\",\"\",IF(#REF!=0,\"\",IF(#REF!=\"\",\"\",$E7+(#REF!/60/24)))),\"\")","v":{"$error":"#REF!"}},"Info","Nationalfeiertag","Österreich",null,null,{"$f":"IF(#REF!=\"J\",\"\",IF($L7=\"\",\"\",IF(ISNA(VLOOKUP($L7,Hallenliste!$A$2:$B$1003,1,FALSE)),\"????\",VLOOKUP($L7,Hallenliste!$A$2:$B$1003,2,FALSE))))","v":{"$error":"#REF!"}},"HPlö"]
[{"$f":"IF(D8=\"\",\"\",YEAR(D8+IF(WEEKDAY(DATE(YEAR(D8),1,1),2)<4,0,-1)) & \" / \" & REPT(\"0\", 2-LEN(WEEKNUM(D8,21))) & WEEKNUM(D8,21))","v":"2023 / 43"},null,{"$f":"TEXT(D8,\"TTT\")","v":"Fr"},"2023-10-27",null,{"$f":"IF(#REF!=\"J\",IF($E8=\"\",\"\",IF(#REF!=0,\"\",IF(#REF!=\"\",\"\",$E8-(#REF!/60/24)))),\"\")","v":{"$error":"#REF!"}},{"$f":"IF(#REF!=\"J\",IF($E8=\"\",\"\",IF(#REF!=0,\"\",IF(#REF!=\"\",\"\",$E8+(#REF!/60/24)))),\"\")","v":{"$error":"#REF!"}},"Info","Beginn Herbstferien","Österreich",null,null,{"$f":"IF(#REF!=\"J\",\"\",IF($L8=\"\",\"\",IF(ISNA(VLOOKUP($L8,Hallenliste!$A$2:$B$1003,1,FALSE)),\"????\",VLOOKUP($L8,Hallenliste!$A$2:$B$1003,2,FALSE))))","v":{"$error":"#REF!"}},"HPlö"]
[]
[{"$f":"IF(D10=\"\",\"\",YEAR(D10+IF(WEEKDAY(DATE(YEAR(D10),1,1),2)<4,0,-1)) & \" / \" & REPT(\"0\", 2-LEN(WEEKNUM(D10,21))) & WEEKNUM(D10,21))","v":"2023 / 45"},"mU10",{"$f":"TEXT(D10,\"TTT\")","v":"So"},"2023-11-12",null,null,null,null,"TS Dornbirn","2. Spieltag","mU10",8016,{"$f":"IF(#REF!=\"J\",\"\",IF($L10=\"\",\"\",IF(ISNA(VLOOKUP($L10,Hallenliste!$A$2:$B$1003,1,FALSE)),\"????\",VLOOKUP($L10,Hallenliste!$A$2:$B$1003,2,FALSE))))","v":{"$error":"#REF!"}},"HPlö"]
["2023 / 45","U08",{"$f":"TEXT(D11,\"TTT\")","v":"So"},"2023-11-12",null,null,{"$f":"IF(#REF!=\"J\",IF($E11=\"\",\"\",IF(#REF!=0,\"\",IF(#REF!=\"\",\"\",$E11+(#REF!/60/24)))),\"\")","v":{"$error":"#REF!"}},null,"Alpla HC Hard","2. Spieltag","U08",8109,null,"HPlö"]
[{"$f":"IF(D12=\"\",\"\",YEAR(D12+IF(WEEKDAY(DATE(YEAR(D12),1,1),2)<4,0,-1)) & \" / \" & REPT(\"0\", 2-LEN(WEEKNUM(D12,21))) & WEEKNUM(D12,21))","v":""},null,null,null,null,null,null,null,null,null,null,null,{"$f":"IF(#REF!=\"J\",\"\",IF($L12=\"\",\"\",IF(ISNA(VLOOKUP($L12,Hallenliste!$A$2:$B$1003,1,FALSE)),\"????\",VLOOKUP($L12,Hallenliste!$A$2:$B$1003,2,FALSE))))","v":{"$error":"#REF!"}},"HPlö"]
["2023 / 46","wu10",{"$f":"TEXT(D13,\"TTT\")","v":"So"},"2023-11-19",null,null,{"$f":"IF(#REF!=\"J\",IF(#REF!=\"\",\"\",IF(#REF!=0,\"\",IF(#REF!=\"\",\"\",#REF!+(#REF!/60/24)))),\"\")","v":{"$error":"#REF!"}},null,"BW Feldkirch","2. Spieltag","wu10",8068,null,"HPlö"]
["",null,null,null,null,null,null,null,null,null,null,null,{"$f":"IF(#REF!=\"J\",\"\",IF($L14=\"\",\"\",IF(ISNA(VLOOKUP($L14,Hallenliste!$A$2:$B$1003,1,FALSE)),\"????\",VLOOKUP($L14,Hallenliste!$A$2:$B$1003,2,FALSE))))","v":{"$error":"#REF!"}},"HPlö"]
["2023 / 47","mU10",{"$f":"TEXT(D15,\"TTT\")","v":"So"},"2023-11-26",null,null,null,null,"HC Hohenems","3. Spieltag","mU10",8034,{"$f":"IF(#REF!=\"J\",\"\",IF($L15=\"\",\"\",IF(ISNA(VLOOKUP($L15,[1]Hallenliste!$A$2:$B$1002,1,FALSE)),\"????\",VLOOKUP($L15,[1]Hallenliste!$A$2:$B$1002,2,FALSE))))","v":{"$error":"#REF!"}},"HPlö"]
[{"$f":"IF(D16=\"\",\"\",YEAR(D16+IF(WEEKDAY(DATE(YEAR(D16),1,1),2)<4,0,-1)) & \" / \" & REPT(\"0\", 2-LEN(WEEKNUM(D16,21))) & WEEKNUM(D16,21))","v":""},null,null,null,null,null,null,null,null,null,null,null,{"$f":"IF(#REF!=\"J\",\"\",IF($L16=\"\",\"\",IF(ISNA(VLOOKUP($L16,Hallenliste!$A$2:$B$1003,1,FALSE)),\"????\",VLOOKUP($L16,Hallenliste!$A$2:$B$1003,2,FALSE))))","v":{"$error":"#REF!"}},"HPlö"]
["2023 / 48","wu10",{"$f":"TEXT(D17,\"TTT\")","v":"So"},"2023-12-03",null,null,{"$f":"IF(#REF!=\"J\",IF(#REF!=\"\",\"\",IF(#REF!=0,\"\",IF(#REF!=\"\",\"\",#REF!+(#REF!/60/24)))),\"\")","v":{"$error":"#REF!"}},null,"HC Lustenau","3. Spieltag","wu10",8055,{"$f":"IF(#REF!=\"J\",\"\",IF($L17=\"\",\"\",IF(ISNA(VLOOKUP($L17,Hallenliste!$A$2:$B$1003,1,FALSE)),\"????\",VLOOKUP($L17,Hallenliste!$A$2:$B$1003,2,FALSE))))","v":{"$error":"#REF!"}},"HPlö"]
["",null,null,null,null,null,null,null,null,null,null,null,{"$f":"IF(#REF!=\"J\",\"\",IF($L18=\"\",\"\",IF(ISNA(VLOOKUP($L18,Hallenliste!$A$2:$B$1003,1,FALSE)),\"????\",VLOOKUP($L18,Hallenliste!$A$2:$B$1003,2,FALSE))))","v":{"$error":"#REF!"}},"HPlö"]
[{"$f":"IF(D19=\"\",\"\",YEAR(D19+IF(WEEKDAY(DATE(YEAR(D19),1,1),2)<4,0,-1)) & \" / \" & REPT(\"0\", 2-LEN(WEEKNUM(D19,21))) & WEEKNUM(D19,21))","v":"2023 / 49"},"U08",{"$f":"TEXT(D19,\"TTT\")","v":"So"},"2023-12-10",null,null,{"$f":"IF(#REF!=\"J\",IF($E19=\"\",\"\",IF(#REF!=0,\"\",IF(#REF!=\"\",\"\",$E19+(#REF!/60/24)))),\"\")","v":{"$error":"#REF!"}},null,"HcB Lauterach","3. Spieltag","U08",8114,{"$f":"IF(#REF!=\"J\",\"\",IF($L19=\"\",\"\",IF(ISNA(VLOOKUP($L19,Hallenliste!$A$2:$B$1003,1,FALSE)),\"????\",VLOOKUP($L19,Hallenliste!$A$2:$B$1003,2,FALSE))))","v":{"$error":"#REF!"}},"HPlö"]
["",null,null,null,null,null,null,null,null,null,null,null,{"$f":"IF(#REF!=\"J\",\"\",IF($L20=\"\",\"\",IF(ISNA(VLOOKUP($L20,Hallenliste!$A$2:$B$1003,1,FALSE)),\"????\",VLOOKUP($L20,Hallenliste!$A$2:$B$1003,2,FALSE))))","v":{"$error":"#REF!"}},"HPlö"]
["2024 / 03","wu10",{"$f":"TEXT(D21,\"TTT\")","v":"So"},"2024-01-21",null,null,{"$f":"IF(#REF!=\"J\",IF(#REF!=\"\",\"\",IF(#REF!=0,\"\",IF(#REF!=\"\",\"\",#REF!+(#REF!/60/24)))),\"\")","v":{"$error":"#REF!"}},null,"HC Hohenems","4. Spieltag","wu10",8034,{"$f":"IF(#REF!=\"J\",\"\",IF($L21=\"\",\"\",IF(ISNA(VLOOKUP($L21,[1]Hallenliste!$A$2:$B$1002,1,FALSE)),\"????\",VLOOKUP($L21,[1]Hallenliste!$A$2:$B$1002,2,FALSE))))","v":{"$error":"#REF!"}},"HPlö"]
["2024 / 03","mU10",{"$f":"TEXT(D22,\"TTT\")","v":"So"},"2024-01-21",null,null,null,null,"BW Feldkirch","4. Spieltag","mU10",8068,{"$f":"IF(#REF!=\"J\",\"\",IF($L22=\"\",\"\",IF(ISNA(VLOOKUP($L22,[1]Hallenliste!$A$2:$B$1002,1,FALSE)),\"????\",VLOOKUP($L22,[1]Hallenliste!$A$2:$B$1002,2,FALSE))))","v":{"$error":"#REF!"}},"HPlö"]
["2024 / 03","U08",{"$f":"TEXT(D23,\"TTT\")","v":"So"},"2024-01-21",null,null,{"$f":"IF(#REF!=\"J\",IF($E23=\"\",\"\",IF(#REF!=0,\"\",IF(#REF!=\"\",\"\",$E23+(#REF!/60/24)))),\"\")","v":{"$error":"#REF!"}},null,"HC Lustenau","4. Spieltag","U08",8055,{"$f":"IF(#REF!=\"J\",\"\",IF($L23=\"\",\"\",IF(ISNA(VLOOKUP($L23,[1]Hallenliste!$A$2:$B$1002,1,FALSE)),\"????\",VLOOKUP($L23,[1]Hallenliste!$A$2:$B$1002,2,FALSE))))","v":{"$error":"#REF!"}},"HPlö"]
["",null,null,null,null,null,null,null,null,null,null,null,{"$f":"IF(#REF!=\"J\",\"\",IF($L24=\"\",\"\",IF(ISNA(VLOOKUP($L24,Hallenliste!$A$2:$B$1003,1,FALSE)),\"????\",VLOOKUP($L24,Hallenliste!$A$2:$B$1003,2,FALSE))))","v":{"$error":"#REF!"}},"HPlö"]
[{"$f":"IF(D25=\"\",\"\",YEAR(D25+IF(WEEKDAY(DATE(YEAR(D25),1,1),2)<4,0,-1)) & \" / \" & REPT(\"0\", 2-LEN(WEEKNUM(D25,21))) & WEEKNUM(D25,21))","v":"2024 / 05"},null,{"$f":"TEXT(D25,\"TTT\")","v":"Sa"},"2024-02-03",null,{"$f":"IF(#REF!=\"J\",IF($E25=\"\",\"\",IF(#REF!=0,\"\",IF(#REF!=\"\",\"\",$E25-(#REF!/60/24)))),\"\")","v":{"$error":"#REF!"}},{"$f":"IF(#REF!=\"J\",IF($E25=\"\",\"\",IF(#REF!=0,\"\",IF(#REF!=\"\",\"\",$E25+(#REF!/60/24)))),\"\")","v":{"$error":"#REF!"}},"Info","Beginn Semesterferien","Vorarlberg"]
["",null,null,null,null,null,null,null,null,null,null,null,{"$f":"IF(#REF!=\"J\",\"\",IF($L26=\"\",\"\",IF(ISNA(VLOOKUP($L26,Hallenliste!$A$2:$B$1003,1,FALSE)),\"????\",VLOOKUP($L26,Hallenliste!$A$2:$B$1003,2,FALSE))))","v":{"$error":"#REF!"}},"HPlö"]
["2024 / 06",null,{"$f":"TEXT(D27,\"TTT\")","v":"So"},"2024-02-11",null,{"$f":"IF(#REF!=\"J\",IF($E27=\"\",\"\",IF(#REF!=0,\"\",IF(#REF!=\"\",\"\",$E27-(#REF!/60/24)))),\"\")","v":{"$error":"#REF!"}},{"$f":"IF(#REF!=\"J\",IF($E27=\"\",\"\",IF(#REF!=0,\"\",IF(#REF!=\"\",\"\",$E27+(#REF!/60/24)))),\"\")","v":{"$error":"#REF!"}},"Info","Ende Semesterferien","Faschingssonntag"]
[{"$f":"IF(D28=\"\",\"\",YEAR(D28+IF(WEEKDAY(DATE(YEAR(D28),1,1),2)<4,0,-1)) & \" / \" & REPT(\"0\", 2-LEN(WEEKNUM(D28,21))) & WEEKNUM(D28,21))","v":""},null,null,null,null,null,null,null,null,null,null,null,{"$f":"IF(#REF!=\"J\",\"\",IF($L28=\"\",\"\",IF(ISNA(VLOOKUP($L28,Hallenliste!$A$2:$B$1003,1,FALSE)),\"????\",VLOOKUP($L28,Hallenliste!$A$2:$B$1003,2,FALSE))))","v":{"$error":"#REF!"}},"HPlö"]
[{"$f":"IF(D29=\"\",\"\",YEAR(D29+IF(WEEKDAY(DATE(YEAR(D29),1,1),2)<4,0,-1)) & \" / \" & REPT(\"0\", 2-LEN(WEEKNUM(D29,21))) & WEEKNUM(D29,21))","v":"2024 / 07"},"U08",{"$f":"TEXT(D29,\"TTT\")","v":"So"},"2024-02-18",null,null,{"$f":"IF(#REF!=\"J\",IF($E29=\"\",\"\",IF(#REF!=0,\"\",IF(#REF!=\"\",\"\",$E29+(#REF!/60/24)))),\"\")","v":{"$error":"#REF!"}},null,"HC Hohenems","5. Spieltag","U08",8034,null,"HPlö"]
["2024 / 07","mU10",{"$f":"TEXT(D30,\"TTT\")","v":"So"},"2024-02-18",null,null,null,null,"Bregenz Handball","5. Spieltag","mU10",8107,{"$f":"IF(#REF!=\"J\",\"\",IF($L30=\"\",\"\",IF(ISNA(VLOOKUP($L30,Hallenliste!$A$2:$B$1003,1,FALSE)),\"????\",VLOOKUP($L30,Hallenliste!$A$2:$B$1003,2,FALSE))))","v":{"$error":"#REF!"}},"HPlö"]
{"$rows_left_out":22}
{"sheet":"Makros","index":1,"n_rows":27,"n_cols":13,"rows_kept":27,"cut":false,"hidden":false,"merged":[]}
["WB","Datwert",null,null,"Anzeigen ab",null,"Datum als Zahl",null,null,null,null,null,"Makro mit: Alt-F11 dann \"Makros\" - \"VBAProjectHCL Gesamtspielpaln.xlam\""]
["J",{"$f":"\">\"&$G$2","v":">44773"},null,null,"2022-08-01",null,{"$f":"DATEVALUE(TEXT(E2,\"TT.MM.JJJJ\"))-1","v":44773}]
[null,null,null,null,null,null,null,null,null,null,null,null,"Strg-R"]
[null,null,null,null,null,null,null,null,null,null,null,null,"DC auf DieseARbeitsmappe"]
[null,null,null,null,null,null,null,null,null,null,null,null,"Strg-i = Standardsortierung"]
["TB","AB","DB","Datwert"]
["J",null,null,{"$f":"\">\"&$G$2","v":">44773"}]
[null,"J",null,{"$f":"\">\"&$G$2","v":">44773"}]
[null,null,"J",{"$f":"\">\"&$G$2","v":">44773"}]
[]
[null,null,null,null,null,"Datei-Grundname"]
[null,null,null,null,null,"HCL-Spiele ab"]
[null,null,null,null,"Datum wie oben","Sicherungs-Verzeichnis"]
[null,null,null,null,null,"C:\\temp\\"]
[null,null,null,null,null,"Mailversand an:"]
[null,null,null,null,null,"boesch.bob@gmail.com"]
[]
[]
[]
[]
[null,"Datwert"]
[null,{"$f":"\">\"&#REF!","v":{"$error":"#REF!"}}]
["WB","Datwert"]
["J","09.11.2008"]
[]
[null,null,null,null,"1.Halbjahr",2019,null,"ab Woche",32]
[null,null,null,null,"2.Halbjahr",2020,null,"ab Woche",1]

{"sheet":"Hallenliste","index":2,"n_rows":863,"n_cols":13,"rows_kept":863,"cut":false,"hidden":false,"merged":[]}
["Halle","Halleninfo - HB","google maps","km erm.am","Kurzname","Name","Land","Plz","Stadt","Strasse","Telefon","Bez#","Bezirk"]
[1001,{"$f":"IF(C2=\"\",\"\",C2&\" km;\")&F2&\";\"&H2&\" \"&I2&\",\"&J2","v":"Wildeckhalle;74232 Abstatt,Beilsteiner Straße"},null,null,"Abstatt","Wildeckhalle","D",74232,"Abstatt","Beilsteiner Straße","07062-67770",1,"Heilbronn-Franken"]
[1002,"Sporthalle Amorbachschule;74172 Neckarsulm-Amorbach,Grenchenstraße 2",null,null,"Amorbach","Sporthalle Amorbachschule","D",74172,"Neckarsulm-Amorbach","Grenchenstraße 2","07132-9830110",1,"Heilbronn-Franken"]
[1003,"Glück-Auf-Halle;74177 Bad Friedrichshall,Fahräckerstraße",null,null,"Bad Fr'hall 1","Glück-Auf-Halle","D",74177,"Bad Friedrichshall","Fahräckerstraße","07136-24649",1,"Heilbronn-Franken"]
[1004,"Kocherwaldhalle beim Gymnasium;74177 Bad Friedrichshall,Hohestraße",null,null,"Bad Fr'hall 2","Kocherwaldhalle beim Gymnasium","D",74177,"Bad Friedrichshall","Hohestraße","07136-9535-13",1,"Heilbronn-Franken"]
[1005,"Mühltalhalle;74906 Bad Rappenau,Heinsheimer Straße 65",null,null,"Bad Rappenau 1","Mühltalhalle","D",74906,"Bad Rappenau","Heinsheimer Straße 65","07264-1609",1,"Heilbronn-Franken"]
[1006,"Kraichgauhalle;74906 Bad Rappenau,Wagnerstraße 9",null,null,"Bad Rappenau 2","Kraichgauhalle","D",74906,"Bad Rappenau","Wagnerstraße 9","07264-3778",1,"Heilbronn-Franken"]
[1007,"Stauferhalle;74206 Bad Wimpfen,Fronhäuserstraße",null,null,"Bad Wimpfen","Stauferhalle","D",74206,"Bad Wimpfen","Fronhäuserstraße","07063-53190",1,"Heilbronn-Franken"]
[1008,"Langhanshalle;71717 Beilstein,Dammstraße",null,null,"Beilstein","Langhanshalle","D",71717,"Beilstein","Dammstraße","07062-3232",1,"Heilbronn-Franken"]
[1009,"Böllingertalhalle;74078 Heilbronn-Biberach,Bibersteige",null,null,"Biberach (HN)","Böllingertalhalle","D",74078,"Heilbronn-Biberach","Bibersteige","07066-7465",1,"Heilbronn-Franken"]
[1010,"Sporthalle auf der Schanz;74080 Heilbronn-Böckingen,Kraichgauplatz 17",null,null,"Böckingen","Sporthalle auf der Schanz","D",74080,"Heilbronn-Böckingen","Kraichgauplatz 17","07131-41594  (Hm.)",1,"Heilbronn-Franken"]
[1011,"Verbandssporthalle;74336 Brackenheim,Im Hirn",null,null,"Brackenheim 1","Verbandssporthalle","D",74336,"Brackenheim","Im Hirn","07135-9829-26",1,"Heilbronn-Franken"]
[1013,"Sport- und Spielhalle;74722 Buchen,Dr.-Fritz-Schmitt-Ring",null,null,"Buchen 1","Sport- und Spielhalle","D",74722,"Buchen","Dr.-Fritz-Schmitt-Ring","06281-4498",1,"Heilbronn-Franken"]
[1014,"Großsporthalle;74564 Crailsheim,Beuerlbacher Straße",null,null,"Crailsheim 1","Großsporthalle","D",74564,"Crailsheim","Beuerlbacher Straße","07951-468027",1,"Heilbronn-Franken"]
[1015,"Karlsberg-Sporthalle;74564 Crailsheim,Auf dem Volksfestplatz",null,null,"Crailsheim 2","Karlsberg-Sporthalle","D",74564,"Crailsheim","Auf dem Volksfestplatz",null,1,"Heilbronn-Franken"]
[1016,"Großsporthalle;75031 Eppingen,Berliner Ring",null,null,"Eppingen","Großsporthalle","D",75031,"Eppingen","Berliner Ring","07262-604214",1,"Heilbronn-Franken"]
[1018,"Sandberghalle;74223 Flein,Talheimer Straße",null,null,"Flein 1","Sandberghalle","D",74223,"Flein","Talheimer Straße","07131-252070",1,"Heilbronn-Franken"]
[1019,"Leintalhalle;74078 Heilbronn-Frankenbach,Würzburger Straße",null,null,"Frankenbach","Leintalhalle","D",74078,"Heilbronn-Frankenbach","Würzburger Straße","07131-483503",1,"Heilbronn-Franken"]
[1020,"Sporthalle;74363 Güglingen,An der Weinsteige",null,null,"Güglingen","Sporthalle","D",74363,"Güglingen","An der Weinsteige","07135-16247",1,"Heilbronn-Franken"]
[1021,"Sporthalle;74831 Gundelsheim,Oststraße 53",null,null,"Gundelsheim","Sporthalle","D",74831,"Gundelsheim","Oststraße 53","06269-45024",1,"Heilbronn-Franken"]
[1022,"Sporthalle Maibachschule;74076 Heilbronn,Paulinenstraße 38",null,null,"Heilbronn 1","Sporthalle Maibachschule","D",74076,"Heilbronn","Paulinenstraße 38","07131-2481",1,"Heilbronn-Franken"]
[1023,"Mönchseehalle;74072 Heilbronn,Karlstraße",null,null,"Heilbronn 2","Mönchseehalle","D",74072,"Heilbronn","Karlstraße","07131-2452",1,"Heilbronn-Franken"]
[1024,"Sporthalle Gustav-v.-Schmoller-Schule;74072 Heilbronn,Schützenstraße",null,null,"Heilbronn 3","Sporthalle Gustav-v.-Schmoller-Schule","D",74072,"Heilbronn","Schützenstraße","07131-2493",1,"Heilbronn-Franken"]
[1026,"Stauwehrhalle;74081 Heilbronn-Horkheim,Nussäckerstraße",null,null,"Horkheim","Stauwehrhalle","D",74081,"Heilbronn-Horkheim","Nussäckerstraße","07131-255515",1,"Heilbronn-Franken"]
[1027,"Schozachtalhalle;74360 Ilsfeld,Beim Schulzentrum",null,null,"Ilsfeld","Schozachtalhalle","D",74360,"Ilsfeld","Beim Schulzentrum","07062-63945",1,"Heilbronn-Franken"]
[1028,"Eberhard-Gienger-Halle;74653 Künzelsau,Jahnstraße",null,null,"Künzelsau","Eberhard-Gienger-Halle","D",74653,"Künzelsau","Jahnstraße","07940-4084",1,"Heilbronn-Franken"]
[1029,"Sporthalle;74348 Lauffen am Neckar,Charlottenstraße",null,null,"Lauffen/Neckar","Sporthalle","D",74348,"Lauffen am Neckar","Charlottenstraße","07133-12911",1,"Heilbronn-Franken"]
[1030,"Eichbotthalle;74211 Leingarten,Beim Freibad",null,null,"Leingarten","Eichbotthalle","D",74211,"Leingarten","Beim Freibad","07131-402140",1,"Heilbronn-Franken"]
[1031,"Jagsttalhalle;74219 Möckmühl,Schulzentrum",null,null,"Möckmühl","Jagsttalhalle","D",74219,"Möckmühl","Schulzentrum","06298-20272",1,"Heilbronn-Franken"]
[1032,"Jahnhalle;74821 Mosbach,Hammerweg 7",null,null,"Mosbach 1","Jahnhalle","D",74821,"Mosbach","Hammerweg 7","06261-18300",1,"Heilbronn-Franken"]
{"$rows_left_out":834}
{"sheet":"Einstellungen","index":3,"n_rows":40,"n_cols":17,"rows_kept":40,"cut":false,"hidden":false,"merged":[]}
["Liga","Vorbereitung","Spielzeit","H_Von","H_Bis","R_Von","R_Bis"]
["M-BL",45,90,"2022-09-17","2022-12-22","2023-01-07","2023-04-30"]
["M-KLA-B",45,90,"2022-09-17","2022-12-22","2023-01-07","2023-04-30"]
["M-Pok-B",30,90,null,null,null,null,"1. Runde","10.09.2022 - 03.10.2022","2. Runde","29.10.2022 - 08.01.2023","3. Runde","04.02.2023 - 02.04.2023","4. Runde","2023-05-06","Final Four","05.05.2018 - 06.05.2010"]
["M-Pok",30,90]
["M-Cup GrA",30,90]
["M-Cup GrB",30,90]
["M-Cup-ER",20,90]
["F-BL",45,90,"2022-09-23","2023-01-07","2023-01-13","2023-04-22"]
["F-Pok-B",30,90,null,null,null,null,"1. Runde","10.09.2022 - 03.10.2022","2. Runde","10.09.2022 - 08.01.2023","3. Runde","04.02.2023 - 02.04.2023","4. Runde","2023-05-06","Final Four","06.05.2017 - 07.05.2017"]
["F-Pok",20,100]
["F-Cup",30,90]
["mJA-BL",45,90,"2022-09-17","2022-12-18","2022-12-17","2023-03-26"]
["mJB-BL",45,75,"2022-09-17","2022-12-18","2023-01-14","2023-04-02"]
["mJC-BL",45,75,"2022-09-17","2022-12-18","2023-01-14","2023-04-02","16 Spiele"]
["gJD-BK-2",45,65,"2022-09-17","2022-11-06","2022-10-29","2022-12-18","10 Spiele"]
["gJD-KLB-2",45,65,"2022-09-17","2022-11-06","2022-10-29","2022-12-18","mD!!"]
["gJD-KLC-2",45,65,"2017-09-17","2022-12-18","2022-12-17","2023-03-26","mD!!"]
["wJA-BL",45,90,"2022-09-23","2023-01-07","2023-01-13","2023-04-22"]
["wJB-BL",45,75,"2022-09-23","2023-01-07","2023-01-13","2023-04-22"]
["wJC-LL-2",45,65,"2022-09-09","2023-01-15","2022-11-04","2023-03-05"]
["wJC-BL",45,65,"2022-09-17","2022-12-18","2023-01-14","2023-04-02"]
["wJC-KLB-2",45,75,"2022-09-17","2022-11-06","2022-10-29","2022-12-18"]
["wJD-KL-2",45,65,"2022-09-17","2022-12-18","2022-12-17","2023-03-26","16 Spiele"]
["wJD-BK",45,65,"2018-01-13"]
["wu10",15,510]
["wu12-VL",20,60,"2017-09-15","2018-03-04"]
["wu12-VL-ER",20,60,null,null,"2018-03-18","2018-04-15"]
["wu14-VL",20,70,"2017-09-15","2018-02-20","2018-01-01","2017-04-29"]
["wu16-VL",20,70]
{"$rows_left_out":11}
{"sheet":"HVW-Staffelinfo Termine","index":4,"n_rows":21,"n_cols":3,"rows_kept":21,"cut":false,"hidden":false,"merged":[]}
["Spielzeiträume"]
[]
["Die folgenden Zeiträume sind allgemein gültig für alle Staffeln."]
["Besondere Spielzeiträme für einzelne Staffeln sind bei diesen aufgeführt."]
[]
["1. Runde","Sa, 23.09.2017 - So, 07.01.2018"]
["2. Runde","Sa, 13.01.2018 - So, 22.04.2018"]
[]
["Anspielzeiten"]
[]
["Werktags","18:00:00","20:30:00"]
["Samstags","10:00:00","20:00:00"]
["Sonntags","10:00:00","17:30:00"]
[]
["Sondertage"]
[]
["An folgenden Tagen gelten abweichende Anspielzeiten:"]
[]
[null,"Sa, 02.12.2017 ","Frauen WM"]
[null,"So, 03.12.2017","Frauen WM"]
[null,"So, 17.12.2017, 10:00h - 11:00h","Frauen WM"]